BDBM50390166 CHEMBL2069844
SMILES N[C@@H](CC(=O)N1CCN(CC1)C(=O)c1ccc(cc1)C(O)=O)Cc1cc(F)c(F)cc1F
InChI Key InChIKey=OJEKLVGMWTUETI-MRXNPFEDSA-N
Data  2 IC50
  Tab Delimited (TSV)   2D SDfile   Computed 3D by Vconf -m prep SDfile
Find this compound or compounds like it in BindingDB:
Activity Spreadsheet -- Enzyme Inhibition Constant Data from BindingDB
Found 2 hits for monomerid = 50390166
TargetCytochrome P450 3A4(Homo sapiens (Human))
Dong-A Pharm.
Curated by ChEMBL
LigandPNGBDBM50390166(CHEMBL2069844)
Affinity DataIC50:  1.00E+3nM. Assay description: Inhibition of CYP3A4
In DepthDetails ArticlePubMed
TargetDipeptidyl peptidase 4(Homo sapiens (Human))
Dong-A Pharm.
Curated by ChEMBL
LigandPNGBDBM50390166(CHEMBL2069844)
Affinity DataIC50:  53.4nM. Assay description: Inhibition of recombinant human DPP4 after 1 hr by fluorescence assay
In DepthDetails ArticlePubMed