BDBM50390183 CHEMBL2069830
SMILES N[C@@H](CC(=O)N1CCN(CC1)c1ccc(F)cc1F)Cc1cc(F)c(F)cc1F
InChI Key InChIKey=HSDLUAXHXJBERN-CQSZACIVSA-N
Data  3 IC50
  Tab Delimited (TSV)   2D SDfile   Computed 3D by Vconf -m prep SDfile
Find this compound or compounds like it in BindingDB:
Activity Spreadsheet -- Enzyme Inhibition Constant Data from BindingDB
Found 3 hits for monomerid = 50390183
TargetDipeptidyl peptidase 9(Homo sapiens (Human))
Dong-A Pharm.
Curated by ChEMBL
LigandPNGBDBM50390183(CHEMBL2069830)
Affinity DataIC50:  1.76E+3nM. Assay description: Inhibition of DPP9
In DepthDetails ArticlePubMed
TargetDipeptidyl peptidase 4(Homo sapiens (Human))
Dong-A Pharm.
Curated by ChEMBL
LigandPNGBDBM50390183(CHEMBL2069830)
Affinity DataIC50:  291nM. Assay description: Inhibition of recombinant human DPP4 after 1 hr by fluorescence assay
In DepthDetails ArticlePubMed
TargetDipeptidyl peptidase 4(Mus musculus)
Dong-A Pharm.
Curated by ChEMBL
LigandPNGBDBM50390183(CHEMBL2069830)
Affinity DataIC50:  94.4nM. Assay description: Inhibition of mouse DPP4
In DepthDetails ArticlePubMed