BDBM50390184 CHEMBL2069858
SMILES N[C@@H](CC(=O)N1CCN(CC1)C(=O)c1cccc(n1)-c1ccc(F)cc1)Cc1cc(F)c(F)cc1F
InChI Key InChIKey=CEUHNJVXCHXXJT-LJQANCHMSA-N
Data  2 IC50
  Tab Delimited (TSV)   2D SDfile   Computed 3D by Vconf -m prep SDfile
Find this compound or compounds like it in BindingDB:
Activity Spreadsheet -- Enzyme Inhibition Constant Data from BindingDB
Found 2 hits for monomerid = 50390184
TargetDipeptidyl peptidase 4(Homo sapiens (Human))
Dong-A Pharm.
Curated by ChEMBL
LigandPNGBDBM50390184(CHEMBL2069858)
Affinity DataIC50:  30.5nM. Assay description: Inhibition of recombinant human DPP4 after 1 hr by fluorescence assay
In DepthDetails ArticlePubMed
TargetDipeptidyl peptidase 9(Homo sapiens (Human))
Dong-A Pharm.
Curated by ChEMBL
LigandPNGBDBM50390184(CHEMBL2069858)
Affinity DataIC50:  658nM. Assay description: Inhibition of DPP9
In DepthDetails ArticlePubMed