BDBM50390266 CHEMBL2070432
SMILES CCN(CC)CCCOc1ccc(cc1)N1C(=S)S\C(=C/c2ccc(Oc3cccc(c3)C(N)=O)cc2)C1=O
InChI Key InChIKey=URJDPGIUJCSXNU-DIBXZPPDSA-N
Data  2 IC50
  Tab Delimited (TSV)   2D SDfile   Computed 3D by Vconf -m prep SDfile
Find this compound or compounds like it in BindingDB:
Activity Spreadsheet -- Enzyme Inhibition Constant Data from BindingDB
Found 2 hits for monomerid = 50390266
TargetInhibitor of nuclear factor kappa-B kinase subunit beta(Mus musculus)
Korea University
Curated by ChEMBL
LigandPNGBDBM50390266(CHEMBL2070432)
Affinity DataIC50:  1.00E+4nM. Assay description: Inhibition of IKKbeta in mouse CIA model spelonocytes assessed as inhibition of TNFalpha production after 72 hrs by ELISA
In DepthDetails ArticlePubMed
TargetInhibitor of nuclear factor kappa-B kinase subunit beta(Homo sapiens (Human))
Korea University
Curated by ChEMBL
LigandPNGBDBM50390266(CHEMBL2070432)
Affinity DataIC50:  7.30E+3nM. Assay description: Inhibition of IKKbeta using 5FAM-GRHDSGLDSMK-NH2 as substrate incubated for 10 mins prior to substrate addition by IMAP-TR-FRET assay
In DepthDetails ArticlePubMed