BDBM50390632 CHEMBL2069605
SMILES COc1ccc(C2=NNC(=O)C2(C)C)c2cc(oc12)C(F)(F)F
InChI Key InChIKey=ZQJJIMQIUJPQGT-UHFFFAOYSA-N
Data  2 IC50
  Tab Delimited (TSV)   2D SDfile   Computed 3D by Vconf -m prep SDfile
Find this compound or compounds like it in BindingDB:
Activity Spreadsheet -- Enzyme Inhibition Constant Data from BindingDB
Found 2 hits for monomerid = 50390632
TargetcAMP-specific 3',5'-cyclic phosphodiesterase 4B(Homo sapiens (Human))
Kyorin Pharmaceutical
Curated by ChEMBL
LigandPNGBDBM50390632(CHEMBL2069605)
Affinity DataIC50:  360nM. Assay description: Inhibition of core catalytic domain of PDE4B
In DepthDetails ArticlePubMed
TargetcGMP-inhibited 3',5'-cyclic phosphodiesterase 3A(Homo sapiens (Human))
Kyorin Pharmaceutical
Curated by ChEMBL
LigandPNGBDBM50390632(CHEMBL2069605)
Affinity DataIC50:  1.10E+3nM. Assay description: Inhibition of core catalytic domain of PDE3A
In DepthDetails ArticlePubMed