BDBM50390650 CHEMBL2069724
SMILES Oc1cccnc1NS(=O)(=O)c1cc(cs1)-c1nc2ccccc2s1
InChI Key InChIKey=OMMVZVLJQHFCJY-UHFFFAOYSA-N
Data  1 IC50
  Tab Delimited (TSV)   2D SDfile   Computed 3D by Vconf -m prep SDfile
Find this compound or compounds like it in BindingDB:
Activity Spreadsheet -- Enzyme Inhibition Constant Data from BindingDB
Found 1 hit for monomerid = 50390650
TargetCyclin-dependent kinase 5 activator 1(Homo sapiens (Human))
Astrazeneca
Curated by ChEMBL
LigandPNGBDBM50390650(CHEMBL2069724)
Affinity DataIC50:  9.94E+3nM. Assay description: Inhibition of human recombinant Cdk5/p25 incubated for 15 mins by scintillation proximity assay
In DepthDetails ArticlePubMed