BDBM50390658 CHEMBL2070003
SMILES COc1cc(NC(=O)c2cccc(O)c2)c(cc1OC)C(O)=O
InChI Key InChIKey=HJZFMYQOUXCRHT-UHFFFAOYSA-N
Data  5 IC50
  Tab Delimited (TSV)   2D SDfile   Computed 3D by Vconf -m prep SDfile
Find this compound or compounds like it in BindingDB:
Activity Spreadsheet -- Enzyme Inhibition Constant Data from BindingDB
Found 5 hits for monomerid = 50390658
TargetAldo-keto reductase family 1 member C1(Homo sapiens (Human))
University Of Ljubljana
Curated by ChEMBL
LigandPNGBDBM50390658(CHEMBL2070003)
Affinity DataIC50:  8.63E+4nM. Assay description: Inhibition of recombinant AKR1C1 using S-tetralol as substrate by fluorimetry
In DepthDetails ArticlePubMed
TargetAldo-keto reductase family 1 member C2(Homo sapiens (Human))
University Of Ljubljana
Curated by ChEMBL
LigandPNGBDBM50390658(CHEMBL2070003)
Affinity DataIC50:  3.00E+4nM. Assay description: Inhibition of recombinant AKR1C2 using S-tetralol as substrate by fluorimetry
In DepthDetails ArticlePubMed
TargetAldo-keto reductase family 1 member C3(Homo sapiens (Human))
University Of Ljubljana
Curated by ChEMBL
LigandPNGBDBM50390658(CHEMBL2070003)
Affinity DataIC50:  5.20E+3nM. Assay description: Inhibition of recombinant AKR1C3 using 1-acenaphthenol as substrate by spectrophotometry
In DepthDetails ArticlePubMed
TargetAldo-keto reductase family 1 member C4(Homo sapiens (Human))
University Of Ljubljana
Curated by ChEMBL
LigandPNGBDBM50390658(CHEMBL2070003)
Affinity DataIC50:  5.09E+4nM. Assay description: Inhibition of recombinant AKR1C4 using S-tetralol as substrate by fluorimetry
In DepthDetails ArticlePubMed
TargetAldo-keto reductase family 1 member C3(Homo sapiens (Human))
University Of Ljubljana
Curated by ChEMBL
LigandPNGBDBM50390658(CHEMBL2070003)
Affinity DataIC50:  2.90E+3nM. Assay description: Inhibition of recombinant AKR1C3 using S-tetralol as substrate by fluorimetry
In DepthDetails ArticlePubMed