BDBM50390933 CHEMBL2071018
SMILES Cc1c(O)c(nn1-c1ccc(C)cc1)C(=O)c1ccccc1
InChI Key InChIKey=FKIVBDPMUAFWGP-UHFFFAOYSA-N
Data  1 KI  1 IC50
  Tab Delimited (TSV)   2D SDfile   Computed 3D by Vconf -m prep SDfile
Find this compound or compounds like it in BindingDB:
Activity Spreadsheet -- Enzyme Inhibition Constant Data from BindingDB
Found 2 hits for monomerid = 50390933
TargetLysine-specific demethylase 4C(Homo sapiens (Human))
University Of Copenhagen
Curated by ChEMBL
LigandPNGBDBM50390933(CHEMBL2071018)
Affinity DataKi: >2.00E+5nM. Assay description: Inhibition of KDM4C catalytic core-mediated demethylation of ARK(Me)3STGGK after 30 mins by FDH-coupled assay
In DepthDetails ArticlePubMed
TargetLysine-specific demethylase 4C(Homo sapiens (Human))
University Of Copenhagen
Curated by ChEMBL
LigandPNGBDBM50390933(CHEMBL2071018)
Affinity DataIC50: >2.00E+5nM. Assay description: Inhibition of KDM4C catalytic core-mediated demethylation of ARK(Me)3STGGK after 30 mins by FDH-coupled assay
In DepthDetails ArticlePubMed