BDBM50391177 CHEMBL2088235
SMILES [#6]\[#6](-[#6])=[#6]\[#6]-[#6]\[#6](-[#6])=[#6]\[#6]-[#6]\[#6](-[#6])=[#6]\[#6]-[#8]-c1ccc2oc(=O)ccc2c1
InChI Key InChIKey=JAASWVRGXJPPHR-WOWYBKFKSA-N
Data  1 IC50
  Tab Delimited (TSV)   2D SDfile   Computed 3D by Vconf -m prep SDfile
Find this compound or compounds like it in BindingDB:
Activity Spreadsheet -- Enzyme Inhibition Constant Data from BindingDB
Found 1 hit for monomerid = 50391177
TargetPolyunsaturated fatty acid lipoxygenase ALOX15(Homo sapiens (Human))
Mashhad University Of Medical Sciences
Curated by ChEMBL
LigandPNGBDBM50391177(CHEMBL2088235)
Affinity DataIC50:  1.30E+3nM. Assay description: Inhibition of recombinant human 15-lipoxygenase by MBTH-DMAB method
In DepthDetails ArticlePubMed