BDBM50391304 CHEMBL350292
SMILES CCc1cnccc1-c1ccc(CO[C@@H]2CC[C@@H]([C@H]2OC\C=C/CCC(O)=O)N2CCCCCC2)cc1
InChI Key InChIKey=VKYMAXGZPKUBLB-ORSPOGDCSA-N
Data  1 IC50  2 Kd
  Tab Delimited (TSV)   2D SDfile   Computed 3D by Vconf -m prep SDfile
Find this compound or compounds like it in BindingDB:
Activity Spreadsheet -- Enzyme Inhibition Constant Data from BindingDB
Found 3 hits for monomerid = 50391304
TargetThromboxane-A synthase(Homo sapiens (Human))
TBA
Curated by ChEMBL
LigandPNGBDBM50391304(CHEMBL350292)
Affinity DataIC50:  398nM. Assay description: In vitro TXA2 synthase antagonism through inhibition of collagen induced thromboxane-A2 production in human citrated whole bloodChecked by Author
In DepthDetails Article
TargetThromboxane A2 receptor(Homo sapiens (Human))
TBA
Curated by ChEMBL
LigandPNGBDBM50391304(CHEMBL350292)
Affinity DataKd:  6.31nM. Assay description: In vitro thromboxane A2 receptor antagonism through inhibition of U-46619-induced platelet aggregation in human whole blood.Checked by Author
In DepthDetails Article
TargetThromboxane A2 receptor(RAT)
TBA
Curated by ChEMBL
LigandPNGBDBM50391304(CHEMBL350292)
Affinity DataKd:  15.8nM. Assay description: In vitro thromboxane A2 receptor antagonism through inhibition of U-46619-induced contraction of rat isolated thoracic aortic stripChecked by Author
In DepthDetails Article