BDBM50391306 CHEMBL161532
SMILES OCCc1ccncc1-c1ccc(CO[C@@H]2CC[C@@H]([C@H]2OC\C=C/CCC(O)=O)N2CCCCCC2)cc1
InChI Key InChIKey=BGPOBSBSTJWARV-HVYQDUJKSA-N
Data  2 Kd
  Tab Delimited (TSV)   2D SDfile   Computed 3D by Vconf -m prep SDfile
Find this compound or compounds like it in BindingDB:
Activity Spreadsheet -- Enzyme Inhibition Constant Data from BindingDB
Found 2 hits for monomerid = 50391306
TargetThromboxane A2 receptor(RAT)
TBA
Curated by ChEMBL
LigandPNGBDBM50391306(CHEMBL161532)
Affinity DataKd:  3.16nM. Assay description: In vitro thromboxane A2 receptor antagonism through inhibition of U-46619-induced contraction of rat isolated thoracic aortic stripChecked by Author
In DepthDetails Article
TargetThromboxane A2 receptor(Homo sapiens (Human))
TBA
Curated by ChEMBL
LigandPNGBDBM50391306(CHEMBL161532)
Affinity DataKd:  3.16nM. Assay description: In vitro thromboxane A2 receptor antagonism through inhibition of U-46619-induced platelet aggregation in human whole blood.Checked by Author
In DepthDetails Article