BDBM50391379 CHEMBL2148004
SMILES CNc1ccccc1-c1c[nH]nn1
InChI Key InChIKey=NFYSFMFKJXQDRX-UHFFFAOYSA-N
Data  1 IC50
  Tab Delimited (TSV)   2D SDfile   Computed 3D by Vconf -m prep SDfile
Find this compound or compounds like it in BindingDB:
Activity Spreadsheet -- Enzyme Inhibition Constant Data from BindingDB
Found 1 hit for monomerid = 50391379
TargetIndoleamine 2,3-dioxygenase 1(Homo sapiens (Human))
Ludwig Center For Cancer Research Of The University Of Lausanne
Curated by ChEMBL
LigandPNGBDBM50391379(CHEMBL2148004)
Affinity DataIC50:  1.80E+6nMpH: 6.5Assay Description:Inhibition of human recombinant N-terminal His-tagged IDO1 (Ala2 to Gly403) overexpressed in Escherichia coli BL21 at pH 6.5 after 60 mins by HPLC an...
In DepthDetails ArticlePubMed