BDBM50391455 CHEMBL2147068
SMILES Cn1c2ccc(cc2c2nc(N3CCC[C@@H](N)C3)n(Cc3cc(Cl)ccc3Cl)c2c1=O)C(O)=O
InChI Key InChIKey=XYCDPKRMDRYLQU-MRXNPFEDSA-N
Data  1 IC50
  Tab Delimited (TSV)   2D SDfile   Computed 3D by Vconf -m prep SDfile
Find this compound or compounds like it in BindingDB:
Activity Spreadsheet -- Enzyme Inhibition Constant Data from BindingDB
Found 1 hit for monomerid = 50391455
TargetDipeptidyl peptidase 4(Homo sapiens (Human))
Dainippon Sumitomo Pharma
Curated by ChEMBL
LigandPNGBDBM50391455(CHEMBL2147068)
Affinity DataIC50:  25nM. Assay description: Inhibition of DPP4 in human plasma using Gly-Pro-AMC as substrate by fluorimetric analysis
In DepthDetails ArticlePubMed