BDBM50391543 CHEMBL2147477
SMILES [#6]-[#6@@H](-[#6]-[#7]-[#6]-c1ccccc1)-[#7]-1-[#6]-[#6@H](-[#6]-[#6]-[#6]\[#7]=[#6](\[#7])-[#7])-[#7](-[#6]-[#6]-c2cccc(F)c2)-[#6]-1=S
InChI Key InChIKey=DSJVYEAOYVHUJW-CVDCTZTESA-N
Data  1 IC50
  Tab Delimited (TSV)   2D SDfile   Computed 3D by Vconf -m prep SDfile
Find this compound or compounds like it in BindingDB:
Activity Spreadsheet -- Enzyme Inhibition Constant Data from BindingDB
Found 1 hit for monomerid = 50391543
TargetMelanin-concentrating hormone receptor 1(RAT)
Leo Pharma
Curated by ChEMBL
LigandPNGBDBM50391543(CHEMBL2147477)
Affinity DataIC50:  6.10nM. Assay description: Antagonist activity at rat MCH1 receptor expressed in HEK 293T cells assessed as inhibition of MCH-induced Ca2+ mobilization after 10 mins by FLIPR a...
In DepthDetails ArticlePubMed