BDBM50391549 CHEMBL2147497
SMILES OCCN(Cc1ccccc1)Cc1coc2cccc(OCC3CCCCC3)c2c1=O
InChI Key InChIKey=CBWLWRZOXVZQDH-UHFFFAOYSA-N
Data  1 IC50
  Tab Delimited (TSV)   2D SDfile   Computed 3D by Vconf -m prep SDfile
Find this compound or compounds like it in BindingDB:
Activity Spreadsheet -- Enzyme Inhibition Constant Data from BindingDB
Found 1 hit for monomerid = 50391549
TargetInterleukin-5(Mus musculus)
Chungnam National University
Curated by ChEMBL
LigandPNGBDBM50391549(CHEMBL2147497)
Affinity DataIC50:  1.61E+4nM. Assay description: Inhibition of IL-5 in mouse Y16 cells after 48 hrs by WST1 assay
In DepthDetails ArticlePubMed