BDBM50391659 CHEMBL2148136
SMILES CC(=O)N1CCN(CC1)c1cnc2cc(cc(NCc3nnc4ccc(nn34)-c3ccc(F)cc3)c2n1)C(F)(F)F
InChI Key InChIKey=VBLYFELQWPIKAY-UHFFFAOYSA-N
Data  1 IC50
  Tab Delimited (TSV)   2D SDfile   Computed 3D by Vconf -m prep SDfile
Find this compound or compounds like it in BindingDB:
Activity Spreadsheet -- Enzyme Inhibition Constant Data from BindingDB
Found 1 hit for monomerid = 50391659
TargetHepatocyte growth factor receptor(Homo sapiens (Human))
China Pharmaceutical University
Curated by ChEMBL
LigandPNGBDBM50391659(CHEMBL2148136)
Affinity DataIC50:  309nM. Assay description: Inhibition of recombinant c-Met kinase domain using poly(Glu,Tyr) as substrate after 60 mins by ELISA
In DepthDetails ArticlePubMed