BDBM50391683 CHEMBL2148176
SMILES [#6]-[#8]-[#6](=O)-[#6](=[#6]/c1ccc(F)cc1F)\[#6](=O)-[#8]-[#6]
InChI Key InChIKey=SNHDJUVWNCXNMP-UHFFFAOYSA-N
Data  1 IC50
  Tab Delimited (TSV)   2D SDfile   Computed 3D by Vconf -m prep SDfile
Find this compound or compounds like it in BindingDB:
Activity Spreadsheet -- Enzyme Inhibition Constant Data from BindingDB
Found 1 hit for monomerid = 50391683
TargetToll-like receptor 4(Mus musculus)
University Of Colorado At Boulder
Curated by ChEMBL
LigandPNGBDBM50391683(CHEMBL2148176)
Affinity DataIC50:  420nM. Assay description: Inhibition of TLR4 in LPS-stimulated mouse RAW264.7 cells assessed as reduction of NO production after 24 hrs
In DepthDetails ArticlePubMed