BDBM50391691 CHEMBL2148182
SMILES [#8]-[#6](=O)-[#6](=[#6]/c1ccccc1F)\[#6](-[#8])=O
InChI Key InChIKey=HIUDSMINTKTCRH-UHFFFAOYSA-N
Data  1 IC50
  Tab Delimited (TSV)   2D SDfile   Computed 3D by Vconf -m prep SDfile
Find this compound or compounds like it in BindingDB:
Activity Spreadsheet -- Enzyme Inhibition Constant Data from BindingDB
Found 1 hit for monomerid = 50391691
TargetToll-like receptor 4(Mus musculus)
University Of Colorado At Boulder
Curated by ChEMBL
LigandPNGBDBM50391691(CHEMBL2148182)
Affinity DataIC50:  410nM. Assay description: Inhibition of TLR4 in LPS-stimulated mouse RAW264.7 cells assessed as reduction of NO production after 24 hrs
In DepthDetails ArticlePubMed