BDBM50391851 CHEMBL2147046::US9133160, 45
SMILES CCOc1ncncc1-c1cccc2n(CC(F)(F)F)cnc12
InChI Key InChIKey=MYGRSEGEONREBO-UHFFFAOYSA-N
Data  2 IC50
  Tab Delimited (TSV)   2D SDfile   Computed 3D by Vconf -m prep SDfile
Find this compound or compounds like it in BindingDB:
Activity Spreadsheet -- Enzyme Inhibition Constant Data from BindingDB
Found 2 hits for monomerid = 50391851
TargetSteroid 17-alpha-hydroxylase/17,20 lyase(Homo sapiens (Human))
TBA
Curated by ChEMBL
LigandPNGBDBM50391851(CHEMBL2147046 | US9133160, 45)
Affinity DataIC50:  135nM. Assay description: Inhibition of CYP17 transfected in human HEK2 cells using [3H]pregnenolone as substrate by SPA assay
In DepthDetails ArticlePubMed
TargetSteroid 17-alpha-hydroxylase/17,20 lyase(Homo sapiens (Human))
TBA
Curated by ChEMBL
LigandPNGBDBM50391851(CHEMBL2147046 | US9133160, 45)
Affinity DataIC50:  135nMpH: 7.2 T: 2°C. Assay description: The assays were performed in U-bottom 384-well optiplates. The final assay volume was 15 ul prepared from 7.5 ul additions of microsomes (prepared as...
In DepthDetails US Patent