BDBM50391922 CHEMBL2147564
SMILES CC(C)(C)NC(=O)c1ccccc1CC[C@]1(O)CCC2=Cc3c(C[C@]12C)cnn3-c1ccc(F)cc1
InChI Key InChIKey=PSUYASCNWJWXIN-KYJUHHDHSA-N
Data  1 KI
  Tab Delimited (TSV)   2D SDfile   Computed 3D by Vconf -m prep SDfile
Find this compound or compounds like it in BindingDB:
Activity Spreadsheet -- Enzyme Inhibition Constant Data from BindingDB
Found 1 hit for monomerid = 50391922
TargetGlucocorticoid receptor(Homo sapiens (Human))
Merck Research Laboratories
Curated by ChEMBL
LigandPNGBDBM50391922(CHEMBL2147564)
Affinity DataKi:  10nM. Assay description: Displacement of [3H]-dexamethasone from human full length GR expressed in insect Sf21 cells
In DepthDetails ArticlePubMed