BDBM50391990 CHEMBL2152296
SMILES CC(C)(C)OC(=O)N[C@@H]1CC[C@H](C1)n1cnc2cnc3[nH]ccc3c12
InChI Key InChIKey=GAVWHEZXKOVIQY-VXGBXAGGSA-N
Data  2 KI  2 EC50
PDB links: 1 PDB ID matches this monomer.
  Tab Delimited (TSV)   2D SDfile   Computed 3D by Vconf -m prep SDfile
Find this compound or compounds like it in BindingDB:
Activity Spreadsheet -- Enzyme Inhibition Constant Data from BindingDB
Found 4 hits for monomerid = 50391990
TargetTyrosine-protein kinase JAK1(Homo sapiens (Human))
Argenta Discovery
Curated by ChEMBL
LigandPNGBDBM50391990(CHEMBL2152296)
Affinity DataKi:  2.20nM. Assay description: Inhibition of JAK1
TargetTyrosine-protein kinase JAK1(Homo sapiens (Human))
Argenta Discovery
Curated by ChEMBL
LigandPNGBDBM50391990(CHEMBL2152296)
Affinity DataKi:  2.20nM. Assay description: Inhibition of JAK1
TargetTyrosine-protein kinase JAK1(Homo sapiens (Human))
Argenta Discovery
Curated by ChEMBL
LigandPNGBDBM50391990(CHEMBL2152296)
Affinity DataEC50:  91nM. Assay description: Inhibition of JAK1 in human TF1 cells assessed as inhibition of IL2-induced STAT3 phosphorylation
TargetTyrosine-protein kinase JAK1(Homo sapiens (Human))
Argenta Discovery
Curated by ChEMBL
LigandPNGBDBM50391990(CHEMBL2152296)
Affinity DataEC50:  91nM. Assay description: Inhibition of JAK1 in human TF1 cells assessed as inhibition of IL2-induced STAT3 phosphorylation