BDBM50392155 CHEMBL2152785
SMILES COc1ccc2CCc3cc(Nc4ccc(F)cc4Cl)ccc3C(=O)c2c1
InChI Key InChIKey=AYSSSXHIRGLQTR-UHFFFAOYSA-N
Data  2 IC50
  Tab Delimited (TSV)   2D SDfile   Computed 3D by Vconf -m prep SDfile
Find this compound or compounds like it in BindingDB:
Activity Spreadsheet -- Enzyme Inhibition Constant Data from BindingDB
Found 2 hits for monomerid = 50392155
TargetMitogen-activated protein kinase 14(Homo sapiens (Human))
Eberhard-Karls University
Curated by ChEMBL
LigandPNGBDBM50392155(CHEMBL2152785)
Affinity DataIC50:  40nM. Assay description: Inhibition of p38alpha by immunosorbent based kinase assay
In DepthDetails ArticlePubMed
TargetMitogen-activated protein kinase 14(Homo sapiens (Human))
Eberhard-Karls University
Curated by ChEMBL
LigandPNGBDBM50392155(CHEMBL2152785)
Affinity DataIC50:  5.40E+3nM. Assay description: Inhibition of p38alpha-dependent TNFalpha production in human whole blood
In DepthDetails ArticlePubMed