BDBM50392172 CHEMBL2152941
SMILES OCCCOc1ccc2CCc3cc(Nc4ccc(F)cc4F)ccc3C(=O)c2c1
InChI Key InChIKey=TWIULMFSTMZSOH-UHFFFAOYSA-N
Data  4 IC50
  Tab Delimited (TSV)   2D SDfile   Computed 3D by Vconf -m prep SDfile
Find this compound or compounds like it in BindingDB:
Activity Spreadsheet -- Enzyme Inhibition Constant Data from BindingDB
Found 4 hits for monomerid = 50392172
TargetMitogen-activated protein kinase 14(Homo sapiens (Human))
Eberhard-Karls University
Curated by ChEMBL
LigandPNGBDBM50392172(CHEMBL2152941)
Affinity DataIC50:  190nM. Assay description: Inhibition of p38alpha-dependent TNFalpha production in human whole blood
In DepthDetails ArticlePubMed
TargetMitogen-activated protein kinase 14(Homo sapiens (Human))
Eberhard-Karls University
Curated by ChEMBL
LigandPNGBDBM50392172(CHEMBL2152941)
Affinity DataIC50:  13nM. Assay description: Competitive inhibition of p38alpha MAP kinase (unknown origin) in presence of 100 uM ATP
In DepthDetails ArticlePubMed
TargetMitogen-activated protein kinase 14(Homo sapiens (Human))
Eberhard-Karls University
Curated by ChEMBL
LigandPNGBDBM50392172(CHEMBL2152941)
Affinity DataIC50:  191nM. Assay description: Inhibition of p38alpha MAP kinase in human whole blood assessed as inhibition of LPS-induced TNFalpha release by ELISA
In DepthDetails ArticlePubMed
TargetMitogen-activated protein kinase 14(Homo sapiens (Human))
Eberhard-Karls University
Curated by ChEMBL
LigandPNGBDBM50392172(CHEMBL2152941)
Affinity DataIC50:  8nM. Assay description: Inhibition of p38alpha by immunosorbent based kinase assay
In DepthDetails ArticlePubMed