BDBM50392180 CHEMBL2152949
SMILES Fc1ccc(Nc2ccc3c(CCc4ccc(OCCN5CCOCC5)cc4C3=O)c2)c(F)c1
InChI Key InChIKey=VFNIKEKVRPXGNA-UHFFFAOYSA-N
Data  2 IC50
  Tab Delimited (TSV)   2D SDfile   Computed 3D by Vconf -m prep SDfile
Find this compound or compounds like it in BindingDB:
Activity Spreadsheet -- Enzyme Inhibition Constant Data from BindingDB
Found 2 hits for monomerid = 50392180
TargetMitogen-activated protein kinase 14(Homo sapiens (Human))
Eberhard-Karls University
Curated by ChEMBL
LigandPNGBDBM50392180(CHEMBL2152949)
Affinity DataIC50:  10nM. Assay description: Inhibition of p38alpha by immunosorbent based kinase assay
In DepthDetails ArticlePubMed
TargetMitogen-activated protein kinase 14(Homo sapiens (Human))
Eberhard-Karls University
Curated by ChEMBL
LigandPNGBDBM50392180(CHEMBL2152949)
Affinity DataIC50:  80nM. Assay description: Inhibition of p38alpha-dependent TNFalpha production in human whole blood
In DepthDetails ArticlePubMed