BDBM50392802 CHEMBL2151248
SMILES CNC(=O)COCC(=O)NCCCCCNC(=O)COCC(=O)N[C@H]1CC[C@@]2(O)[C@H]3Cc4ccc(O)c5O[C@@H]1[C@]2(CCN3C)c45
InChI Key InChIKey=RKXDQMHWZITBEE-ZYGMWPOSSA-N
Data  1 KI
  Tab Delimited (TSV)   2D SDfile   Computed 3D by Vconf -m prep SDfile
Find this compound or compounds like it in BindingDB:
Activity Spreadsheet -- Enzyme Inhibition Constant Data from BindingDB
Found 1 hit for monomerid = 50392802
TargetMu-type opioid receptor(MOUSE)
TBA
Curated by ChEMBL
LigandPNGBDBM50392802(CHEMBL2151248)
Affinity DataKi:  22.4nM. Assay description: Displacement of [3H]-DAMGO from mouse MOR expressed in HEK293 cells
In DepthDetails ArticlePubMed