BDBM50392847 CHEMBL2151040
SMILES COc1cccc(c1)-c1cccc(c1)[C@@]1(CC(=O)N(C)C(N)=N1)c1ccccc1
InChI Key InChIKey=HWRRBABUUNBUPZ-XMMPIXPASA-N
Data  1 KI
  Tab Delimited (TSV)   2D SDfile   Computed 3D by Vconf -m prep SDfile
Find this compound or compounds like it in BindingDB:
Activity Spreadsheet -- Enzyme Inhibition Constant Data from BindingDB
Found 1 hit for monomerid = 50392847
TargetBeta-secretase 1(Homo sapiens (Human))
TBA
Curated by ChEMBL
LigandPNGBDBM50392847(CHEMBL2151040)
Affinity DataKi:  2.20E+4nM. Assay description: Inhibition of human recombinant BACE1 by FRET assay
In DepthDetails ArticlePubMed