BDBM50392987 CHEMBL2152387
SMILES COC(=O)c1c(Cc2ccc(cc2)C(=O)N[C@H]2CC[C@H](O)CC2)c(=O)c2cccnc2n1-c1ccccc1
InChI Key InChIKey=VJJLDGVIEMEYDL-AFARHQOCSA-N
Data  1 IC50  1 EC50
  Tab Delimited (TSV)   2D SDfile   Computed 3D by Vconf -m prep SDfile
Find this compound or compounds like it in BindingDB:
Activity Spreadsheet -- Enzyme Inhibition Constant Data from BindingDB
Found 2 hits for monomerid = 50392987
TargetMitogen-activated protein kinase 8(Homo sapiens (Human))
TBA
Curated by ChEMBL
LigandPNGBDBM50392987(CHEMBL2152387)
Affinity DataEC50:  1.40E+4nM. Assay description: Inhibition of JNK1-mediated c-jun phosphorylation in TNF-alpha stimulated human HK-2 cells after 30 mins by TR-FRET assay
In DepthDetails ArticlePubMed
TargetMitogen-activated protein kinase 8(Homo sapiens (Human))
TBA
Curated by ChEMBL
LigandPNGBDBM50392987(CHEMBL2152387)
Affinity DataIC50:  54nM. Assay description: Inhibition of JNK1 after 30 mins by TR-FRET assay
In DepthDetails ArticlePubMed