BDBM50393096 CHEMBL2152911::US9346827, 15
SMILES CC(C)(C)COc1cc(F)c2Oc3ccc(cc3[C@@]3(COCCC(N)=N3)c2c1)-c1cccnc1F
InChI Key InChIKey=AFJAHDBTQQSSKB-MHZLTWQESA-N
Data  3 IC50
  Tab Delimited (TSV)   2D SDfile   Computed 3D by Vconf -m prep SDfile
Find this compound or compounds like it in BindingDB:
Activity Spreadsheet -- Enzyme Inhibition Constant Data from BindingDB
Found 3 hits for monomerid = 50393096
TargetBeta-secretase 1(Homo sapiens (Human))
Amgen
US Patent
LigandPNGBDBM50393096(CHEMBL2152911 | US9346827, 15)
Affinity DataIC50:  0.5nMpH: 4.2Assay Description:The assay buffer used in this screen is 0.05 M acetate, pH 4.2, 10% DMSO final, 100 uM genapol (which is a nonionic detergent, below its Critical Mic...
In DepthDetails US Patent
TargetBeta-secretase 1(Homo sapiens (Human))
Amgen
US Patent
LigandPNGBDBM50393096(CHEMBL2152911 | US9346827, 15)
Affinity DataIC50:  0.5nM. Assay description: Inhibition of BACE1 by FRET assay
In DepthDetails ArticlePubMed
TargetBeta-secretase 1(Homo sapiens (Human))
Amgen
US Patent
LigandPNGBDBM50393096(CHEMBL2152911 | US9346827, 15)
Affinity DataIC50:  7nM. Assay description: Inhibition of BACE1 expressed in HEK cells by cell-based assay
In DepthDetails ArticlePubMed