BDBM50393143 CHEMBL2153581
SMILES Fc1ccc(cc1C(F)(F)F)-c1cc(CNC(=O)CCCc2ccc3cccnc3n2)on1
InChI Key InChIKey=SWKGPCNQBPGWNX-UHFFFAOYSA-N
Data  3 IC50
  Tab Delimited (TSV)   2D SDfile   Computed 3D by Vconf -m prep SDfile
Find this compound or compounds like it in BindingDB:
Activity Spreadsheet -- Enzyme Inhibition Constant Data from BindingDB
Found 3 hits for monomerid = 50393143
TargetSuccinate receptor 1(Homo sapiens (Human))
Advinus Therapeutics
Curated by ChEMBL
LigandPNGBDBM50393143(CHEMBL2153581)
Affinity DataIC50:  35nM. Assay description: Antagonist activity at human GPR91 receptor expressed in CHO-K1 cells co-expressing Galpha and Gqi5 G-protein assessed as inhibition of succinate-ind...
In DepthDetails ArticlePubMed
TargetSuccinate receptor 1(Rattus norvegicus)
Advinus Therapeutics
Curated by ChEMBL
LigandPNGBDBM50393143(CHEMBL2153581)
Affinity DataIC50:  135nM. Assay description: Antagonist activity at rat GPR91 receptor expressed in CHO-K1 cells co-expressing Galpha and Gqi5 G-protein assessed as inhibition of succinate-induc...
In DepthDetails ArticlePubMed
Target2-oxoglutarate receptor 1(Homo sapiens (Human))
Advinus Therapeutics
Curated by ChEMBL
LigandPNGBDBM50393143(CHEMBL2153581)
Affinity DataIC50: >3.00E+4nM. Assay description: Antagonist activity at human GPR99 receptor expressed in CHO-K1 cells co-expressing Galpha and Gqi5 G-protein assessed as inhibition of succinate-ind...
In DepthDetails ArticlePubMed