BDBM50393457 CHEMBL2159689
SMILES CNC(=O)OCC[C@@H]1OCC[C@@]2([C@H]1COc1c(F)ccc(F)c21)S(=O)(=O)c1ccc(Cl)cc1
InChI Key InChIKey=FZLVZULDXHXGFA-VPKVUBIPSA-N
Data  3 IC50
  Tab Delimited (TSV)   2D SDfile   Computed 3D by Vconf -m prep SDfile
Find this compound or compounds like it in BindingDB:
Activity Spreadsheet -- Enzyme Inhibition Constant Data from BindingDB
Found 3 hits for monomerid = 50393457
TargetPresenilin-1(Homo sapiens (Human))
TBA
Curated by ChEMBL
LigandPNGBDBM50393457(CHEMBL2159689)
Affinity DataIC50:  8nM. Assay description: Inhibition of PS1 gamma-secretase expressed in HEK cells harboring Awe-Lon gene assessed as reduction of amyloid beta-40 production
In DepthDetails ArticlePubMed
TargetPresenilin-2(Homo sapiens (Human))
TBA
Curated by ChEMBL
LigandPNGBDBM50393457(CHEMBL2159689)
Affinity DataIC50:  6nM. Assay description: Inhibition of PS2 gamma-secretase expressed in HEK cells harboring Awe-Lon gene assessed as reduction of amyloid beta-42 production
In DepthDetails ArticlePubMed
TargetPresenilin-1(Homo sapiens (Human))
TBA
Curated by ChEMBL
LigandPNGBDBM50393457(CHEMBL2159689)
Affinity DataIC50:  8nM. Assay description: Inhibition of PS1 gamma-secretase assessed as reduction of amyloid beta-40 production by membrane based assay
In DepthDetails ArticlePubMed