BDBM50393471 CHEMBL2159948
SMILES Cc1ccc2[nH]c(=O)c(cc2c1)C(N1CCN(CC1)c1ccccc1)c1nnnn1C1CCCC1
InChI Key InChIKey=OVMGBYGGBPLWQL-UHFFFAOYSA-N
Data  2 IC50
  Tab Delimited (TSV)   2D SDfile   Computed 3D by Vconf -m prep SDfile
Find this compound or compounds like it in BindingDB:
Activity Spreadsheet -- Enzyme Inhibition Constant Data from BindingDB
Found 2 hits for monomerid = 50393471
TargetTyrosine-protein phosphatase non-receptor type 7(Homo sapiens (Human))
University Of Southern California
Curated by ChEMBL
LigandPNGBDBM50393471(CHEMBL2159948)
Affinity DataIC50: >7.50E+4nM. Assay description: Inhibition of HePTP expressed in Escherichia coli BL21 using pNPP substrate
In DepthDetails ArticlePubMed
TargetTyrosine-protein phosphatase non-receptor type 22(Homo sapiens (Human))
University Of Southern California
Curated by ChEMBL
LigandPNGBDBM50393471(CHEMBL2159948)
Affinity DataIC50:  3.07E+4nM. Assay description: Inhibition of LYP expressed in Escherichia coli BL21 using pNPP substrate
In DepthDetails ArticlePubMed