BDBM50393508 CHEMBL2158054
SMILES CN[C@@H](C)C(=O)N[C@H]1CN(CC[C@H]2CC[C@H](N2C1=O)C(=O)N[C@H](c1cn(CCCCCCCCCCNC(=O)c2ccc(c(c2)C(O)=O)-c2c3ccc(O)cc3oc3cc(=O)ccc23)nn1)c1ccccc1)C(=O)CC(C)C
InChI Key InChIKey=NAOHXUOBXHDSFA-KOYPEAILSA-N
Data  3 Kd
  Tab Delimited (TSV)   2D SDfile   Computed 3D by Vconf -m prep SDfile
Find this compound or compounds like it in BindingDB:
Activity Spreadsheet -- Enzyme Inhibition Constant Data from BindingDB
Found 3 hits for monomerid = 50393508
TargetE3 ubiquitin-protein ligase XIAP(Homo sapiens (Human))
University Of Michigan
Curated by ChEMBL
LigandPNGBDBM50393508(CHEMBL2158054)
Affinity DataKd:  4.40nM. Assay description: Binding affinity to His6-tagged human XIAP BIR3 domain expressed in Escherichia coli BL21(DE3) assessed as dissociation constant after 2 to 3 hrs by ...
In DepthDetails ArticlePubMed
TargetBaculoviral IAP repeat-containing protein 3(Homo sapiens (Human))
University Of Michigan
Curated by ChEMBL
LigandPNGBDBM50393508(CHEMBL2158054)
Affinity DataKd:  1.90nM. Assay description: Binding affinity to human cIAP2 BIR3 domain expressed in Escherichia coli BL21(DE3) assessed as dissociation constant after 2 to 3 hrs by fluorescenc...
In DepthDetails ArticlePubMed
TargetBaculoviral IAP repeat-containing protein 2(Homo sapiens (Human))
University Of Michigan
Curated by ChEMBL
LigandPNGBDBM50393508(CHEMBL2158054)
Affinity DataKd:  0.700nM. Assay description: Binding affinity to human cIAP1 BIR3 domain expressed in Escherichia coli BL21(DE3) assessed as dissociation constant after 2 to 3 hrs by fluorescenc...
In DepthDetails ArticlePubMed