BDBM50393534 CHEMBL2158220
SMILES OP(O)(=O)CCc1cncc2cc[nH]c12
InChI Key InChIKey=LVHSQZVTYLVLDO-UHFFFAOYSA-N
Data  2 IC50
  Tab Delimited (TSV)   2D SDfile   Computed 3D by Vconf -m prep SDfile
Find this compound or compounds like it in BindingDB:
Activity Spreadsheet -- Enzyme Inhibition Constant Data from BindingDB
Found 2 hits for monomerid = 50393534
TargetLow molecular weight phosphotyrosine protein phosphatase(Homo sapiens (Human))
University Of Messina
Curated by ChEMBL
LigandPNGBDBM50393534(CHEMBL2158220)
Affinity DataIC50:  2.76E+6nM. Assay description: Inhibition of human LMW-PTPase isoform 2
In DepthDetails ArticlePubMed
TargetLow molecular weight phosphotyrosine protein phosphatase(Homo sapiens (Human))
University Of Messina
Curated by ChEMBL
LigandPNGBDBM50393534(CHEMBL2158220)
Affinity DataIC50:  1.79E+6nM. Assay description: Inhibition of human LMW-PTPase isoform 1
In DepthDetails ArticlePubMed