BDBM50393571 CHEMBL2158489
SMILES COc1cc(ccc1OC(=O)c1cccs1)[C@H]1[C@@](NC(=O)c2ccc(NC(=O)C(C)(C)C)cc2)([C@@H](c2ccc(OC(=O)c3cccs3)c(OC)c2)[C@]1(NC(=O)c1ccc(NC(=O)C(C)(C)C)cc1)C(O)=O)C(O)=O
InChI Key InChIKey=JZEUALVXLVKESI-NHONBVHKSA-N
Data  1 IC50  1 EC50
  Tab Delimited (TSV)   2D SDfile   Computed 3D by Vconf -m prep SDfile
Find this compound or compounds like it in BindingDB:
Activity Spreadsheet -- Enzyme Inhibition Constant Data from BindingDB
Found 2 hits for monomerid = 50393571
TargetGlucagon-like peptide 1 receptor(Rattus norvegicus)
The National Center For Drug Screening
Curated by ChEMBL
LigandPNGBDBM50393571(CHEMBL2158489)
Affinity DataIC50:  500nM. Assay description: Inhibition of [125I]GLP1 (7-36) amide binding to rat GLP1R expressed in HEK293 cells
In DepthDetails ArticlePubMed
TargetGlucagon-like peptide 1 receptor(Rattus norvegicus)
The National Center For Drug Screening
Curated by ChEMBL
LigandPNGBDBM50393571(CHEMBL2158489)
Affinity DataEC50:  1.11E+3nM. Assay description: Agonist activity at rat GLP1R expressed in HEK293 cells assessed as stimulation of cAMP levels incubated for 6 hrs by multiple response element/cAMP ...
In DepthDetails ArticlePubMed