BDBM50393629 CHEMBL2158523
SMILES COc1ccc(cc1Nc1ncc2ccc(-c3ccccc3N(C)S(C)(=O)=O)n2n1)N1CCN(C)CC1
InChI Key InChIKey=ZYOXIFIPQVURBE-UHFFFAOYSA-N
Data  1 IC50
  Tab Delimited (TSV)   2D SDfile   Computed 3D by Vconf -m prep SDfile
Find this compound or compounds like it in BindingDB:
Activity Spreadsheet -- Enzyme Inhibition Constant Data from BindingDB
Found 1 hit for monomerid = 50393629
TargetALK tyrosine kinase receptor(Homo sapiens (Human))
Cephalon
Curated by ChEMBL
LigandPNGBDBM50393629(CHEMBL2158523)
Affinity DataIC50:  28nM. Assay description: Inhibition of GST-tagged human ALK cytoplasmic domain (1058-1620) expressed in Sf21 insect cells using GST-tagged human recombinant PLC-gamma/substra...
In DepthDetails ArticlePubMed