BDBM50393647 CHEMBL2158694
SMILES CCCCCCCCCCc1ccc(cc1)[C@H]1CC[C@@H](CC1)[N+](C)(C)CCC
InChI Key InChIKey=LWVFCAZIUFBONI-MCZWQBSQSA-N
Data  2 KI
  Tab Delimited (TSV)   2D SDfile   Computed 3D by Vconf -m prep SDfile
Find this compound or compounds like it in BindingDB:
Activity Spreadsheet -- Enzyme Inhibition Constant Data from BindingDB
Found 2 hits for monomerid = 50393647
TargetSphingosine kinase 1(Homo sapiens (Human))
Virginia Tech
Curated by ChEMBL
LigandPNGBDBM50393647(CHEMBL2158694)
Affinity DataKi:  3.50E+4nM. Assay description: Inhibition of recombinant SphK1 expressed in baculovirus infected Sf9 cells using D-erythro-sphingosine as substrate and [32gammaP]ATP by scintillati...
In DepthDetails ArticlePubMed
TargetSphingosine kinase 2(Homo sapiens (Human))
Virginia Tech
Curated by ChEMBL
LigandPNGBDBM50393647(CHEMBL2158694)
Affinity DataKi:  4.30E+4nM. Assay description: Inhibition of recombinant SphK2 expressed in baculovirus infected Sf9 cells using D-erythro-sphingosine as substrate and [32gammaP]ATP by scintillati...
In DepthDetails ArticlePubMed