BDBM50393778 CHEMBL2159351
SMILES CCCOc1cc(Cl)cc(c1)-c1cc(-c2ccc3cc(OC)ccc3c2)n(n1)[C@@H](C)c1ccc(cc1)C(=O)NCCC(O)=O
InChI Key InChIKey=SMMALWVNYOQSQD-QFIPXVFZSA-N
Data  3 IC50
  Tab Delimited (TSV)   2D SDfile   Computed 3D by Vconf -m prep SDfile
Find this compound or compounds like it in BindingDB:
Activity Spreadsheet -- Enzyme Inhibition Constant Data from BindingDB
Found 3 hits for monomerid = 50393778
TargetGlucagon receptor(Homo sapiens (Human))
Merck Research Laboratories
Curated by ChEMBL
LigandPNGBDBM50393778(CHEMBL2159351)
Affinity DataIC50:  6.90nM. Assay description: Displacement of [125I]glucagon from human GCGR expressed in CHO cells after 3 hrs by scintillation proximity assay
In DepthDetails ArticlePubMed
TargetGastric inhibitory polypeptide receptor(Homo sapiens (Human))
Merck Research Laboratories
Curated by ChEMBL
LigandPNGBDBM50393778(CHEMBL2159351)
Affinity DataIC50:  2.06E+3nM. Assay description: Antagonist activity at human GIPR expressed in CHO cells assessed as inhibition of glucagon-induced cAMP accumulation preincubated for 30 mins prior ...
In DepthDetails ArticlePubMed
TargetGlucagon receptor(Homo sapiens (Human))
Merck Research Laboratories
Curated by ChEMBL
LigandPNGBDBM50393778(CHEMBL2159351)
Affinity DataIC50:  47nM. Assay description: Antagonist activity at human GCGR expressed in CHO cells assessed as inhibition of glucagon-induced cAMP accumulation preincubated for 30 mins prior ...
In DepthDetails ArticlePubMed