BDBM50394250 CHEMBL2159280
SMILES NC(=[NH2+])c1ccc(CNC(=O)[C@@H](COCc2ccccc2)NS(=O)(=O)c2cccc(c2)C(N)=[NH2+])cc1
InChI Key InChIKey=LDOZXDLBMUPMAO-JOCHJYFZSA-P
Data  2 KI
  Tab Delimited (TSV)   2D SDfile   Computed 3D by Vconf -m prep SDfile
Find this compound or compounds like it in BindingDB:
Activity Spreadsheet -- Enzyme Inhibition Constant Data from BindingDB
Found 2 hits for monomerid = 50394250
TargetProthrombin(Homo sapiens (Human))
University Of Bonn
Curated by ChEMBL
LigandPNGBDBM50394250(CHEMBL2159280)
Affinity DataKi:  530nM. Assay description: Inhibition of human thrombin using fluorogenic Cbz-Gly-Gly-Arg-NH-Mec as substrate measured over 400 secs by spectrophotometry
In DepthDetails ArticlePubMed
TargetTransmembrane protease serine 6(Homo sapiens (Human))
University Of Bonn
Curated by ChEMBL
LigandPNGBDBM50394250(CHEMBL2159280)
Affinity DataKi:  1.25E+4nM. Assay description: Inhibition of human matriptase-2 expressed in HEK-MT2 cells using fluorogenic Boc- Gln-Ala-Arg-NH-Mec as substrate measured over 400 secs by spectrop...
In DepthDetails ArticlePubMed