BDBM50394272 CHEMBL2159298
SMILES NC(=[NH2+])c1ccc(cc1)S(=O)(=O)NCCC(=O)Nc1cccc(c1)C(O)=O
InChI Key InChIKey=RNTUDLFAIAWDMW-UHFFFAOYSA-O
Data  2 IC50
  Tab Delimited (TSV)   2D SDfile   Computed 3D by Vconf -m prep SDfile
Find this compound or compounds like it in BindingDB:
Activity Spreadsheet -- Enzyme Inhibition Constant Data from BindingDB
Found 2 hits for monomerid = 50394272
TargetTransmembrane protease serine 6(Homo sapiens (Human))
University Of Bonn
Curated by ChEMBL
LigandPNGBDBM50394272(CHEMBL2159298)
Affinity DataIC50: >5.00E+5nM. Assay description: Inhibition of human matriptase-2 expressed in HEK-MT2 cells using fluorogenic Boc- Gln-Ala-Arg-NH-Mec as substrate measured over 400 secs by spectrop...
In DepthDetails ArticlePubMed
TargetProthrombin(Homo sapiens (Human))
University Of Bonn
Curated by ChEMBL
LigandPNGBDBM50394272(CHEMBL2159298)
Affinity DataIC50: >5.00E+5nM. Assay description: Inhibition of human thrombin using fluorogenic Cbz-Gly-Gly-Arg-NH-Mec as substrate measured over 400 secs by spectrophotometry
In DepthDetails ArticlePubMed