BDBM50394308 CHEMBL2159379
SMILES COc1cccc(CNS(=O)(=O)c2cccc(c2)C(N)=N)c1
InChI Key InChIKey=MWPWLCXBNFQOLE-UHFFFAOYSA-N
Data  1 KI  1 IC50
  Tab Delimited (TSV)   2D SDfile   Computed 3D by Vconf -m prep SDfile
Find this compound or compounds like it in BindingDB:
Activity Spreadsheet -- Enzyme Inhibition Constant Data from BindingDB
Found 2 hits for monomerid = 50394308
TargetProthrombin(Homo sapiens (Human))
University Of Bonn
Curated by ChEMBL
LigandPNGBDBM50394308(CHEMBL2159379)
Affinity DataKi:  1.65E+5nM. Assay description: Inhibition of human thrombin using fluorogenic Cbz-Gly-Gly-Arg-NH-Mec as substrate measured over 400 secs by spectrophotometry
In DepthDetails ArticlePubMed
TargetTransmembrane protease serine 6(Homo sapiens (Human))
University Of Bonn
Curated by ChEMBL
LigandPNGBDBM50394308(CHEMBL2159379)
Affinity DataIC50: >5.00E+5nM. Assay description: Inhibition of human matriptase-2 expressed in HEK-MT2 cells using fluorogenic Boc- Gln-Ala-Arg-NH-Mec as substrate measured over 400 secs by spectrop...
In DepthDetails ArticlePubMed