BDBM50394375 CHEMBL2159812
SMILES O=C(Nc1ccccc1)c1cccc(CN2CCN(CC2)C(=O)n2nnc3ccccc23)c1
InChI Key InChIKey=DCVLGQNYMNDDTI-UHFFFAOYSA-N
Data  2 IC50
  Tab Delimited (TSV)   2D SDfile   Computed 3D by Vconf -m prep SDfile
Find this compound or compounds like it in BindingDB:
Activity Spreadsheet -- Enzyme Inhibition Constant Data from BindingDB
Found 2 hits for monomerid = 50394375
TargetMonoglyceride lipase(Homo sapiens (Human))
Sapienza University Of Rome
Curated by ChEMBL
LigandPNGBDBM50394375(CHEMBL2159812)
Affinity DataIC50:  7nM. Assay description: Inhibition of human MAGL assessed as [3H]-2-OG hydrolysis preincubated for 30 mins before [3H]-2-OG addition measured after 10 mins by liquid scintil...
In DepthDetails ArticlePubMed
TargetFatty-acid amide hydrolase 1(Homo sapiens (Human))
Sapienza University Of Rome
Curated by ChEMBL
LigandPNGBDBM50394375(CHEMBL2159812)
Affinity DataIC50:  35nM. Assay description: Inhibition of human recombinant FAAH assessed as [3H]-AEA hydrolysis preincubated for 30 mins before [3H]-2-OG addition measured after 10 mins by liq...
In DepthDetails ArticlePubMed