BDBM50394676 CHEMBL2165252
SMILES OC(=O)C[C@]1(O[C@H]1C(O)=O)C(O)=O
InChI Key InChIKey=NEDLLNIZNWRDMG-BBIVZNJYSA-N
Data  1 KI
  Tab Delimited (TSV)   2D SDfile   Computed 3D by Vconf -m prep SDfile
Find this compound or compounds like it in BindingDB:
Activity Spreadsheet -- Enzyme Inhibition Constant Data from BindingDB
Found 1 hit for monomerid = 50394676
TargetATP-citrate synthase(Rattus norvegicus)
Wayne State University
Curated by ChEMBL
LigandPNGBDBM50394676(CHEMBL2165252)
Affinity DataKi:  1.80E+4nM. Assay description: Inhibition of rat liver ACLY
In DepthDetails ArticlePubMed