BDBM50394834 CHEMBL2164236
SMILES CCN(CCO)C[C@H]1CC[C@H](CCN(C)C(=O)Oc2ccc(cc2)C(F)(F)F)CC1
InChI Key InChIKey=MUXRZYNIEMIEAL-IYARVYRRSA-N
Data  1 IC50
  Tab Delimited (TSV)   2D SDfile   Computed 3D by Vconf -m prep SDfile
Find this compound or compounds like it in BindingDB:
Activity Spreadsheet -- Enzyme Inhibition Constant Data from BindingDB
Found 1 hit for monomerid = 50394834
TargetLanosterol synthase(Homo sapiens (Human))
Centre Hospitalier Universitaire Vaudois (Chuv) And University Of Lausanne (Unil
Curated by ChEMBL
LigandPNGBDBM50394834(CHEMBL2164236)
Affinity DataIC50:  12.7nM. Assay description: Inhibition of human liver microsome 2,3-OSC after 1 hr by Silica gel plate phosphor imaging
In DepthDetails ArticlePubMed