BDBM50395380 CHEMBL2164709::US9168247, JR84
SMILES Cc1nccc2c3ccc(OCc4ccccc4)cc3n(Cc3ccccc3)c12
InChI Key InChIKey=RRSQKKMTIRLMGU-UHFFFAOYSA-N
Data  2 IC50
  Tab Delimited (TSV)   2D SDfile   Computed 3D by Vconf -m prep SDfile
Find this compound or compounds like it in BindingDB:
Activity Spreadsheet -- Enzyme Inhibition Constant Data from BindingDB
Found 2 hits for monomerid = 50395380
TargetDual specificity tyrosine-phosphorylation-regulated kinase 1A(Homo sapiens (Human))
University Of Namur (Fundp)
Curated by ChEMBL
LigandPNGBDBM50395380(CHEMBL2164709 | US9168247, JR84)
Affinity DataIC50:  1.60E+4nM. Assay description: Inhibition of DYRK1A kinase using RBER-CHKtide substrate by radiometric protein kinase assay
In DepthDetails ArticlePubMed
TargetDual specificity tyrosine-phosphorylation-regulated kinase 1A(Homo sapiens (Human))
University Of Namur (Fundp)
Curated by ChEMBL
LigandPNGBDBM50395380(CHEMBL2164709 | US9168247, JR84)
Affinity DataIC50:  1.63E+4nMpH: 7.5Assay Description:A radiometric protein kinase assay (33PanQinase Activity Assay) was used for measuring the kinase activity of DYRK1A protein kinase. All kinase assay...
In DepthDetails US Patent