BDBM50395475 CHEMBL2163350
SMILES CCC(C(=O)Nc1ccccc1-n1cccc1)c1ccccc1
InChI Key InChIKey=YMKSNPNHFDHINA-UHFFFAOYSA-N
Data  1 IC50
  Tab Delimited (TSV)   2D SDfile   Computed 3D by Vconf -m prep SDfile
Find this compound or compounds like it in BindingDB:
Activity Spreadsheet -- Enzyme Inhibition Constant Data from BindingDB
Found 1 hit for monomerid = 50395475
TargetPotassium voltage-gated channel subfamily KQT member 2(Homo sapiens (Human))
Vanderbilt University Medical Center
Curated by ChEMBL
LigandPNGBDBM50395475(CHEMBL2163350)
Affinity DataIC50:  5.27E+3nM. Assay description: Antagonist activity at KCNQ2 expressed in CHO cells incubated for 3 mins by automated patch clamp assay
In DepthDetails ArticlePubMed