BDBM50395495 CHEMBL2164050
SMILES FC(C(=O)Nc1ccccc1N1CCCC1)c1ccccc1
InChI Key InChIKey=NJKREBVBBUCBFR-UHFFFAOYSA-N
Data  1 EC50
  Tab Delimited (TSV)   2D SDfile   Computed 3D by Vconf -m prep SDfile
Find this compound or compounds like it in BindingDB:
Activity Spreadsheet -- Enzyme Inhibition Constant Data from BindingDB
Found 1 hit for monomerid = 50395495
TargetPotassium voltage-gated channel subfamily KQT member 2(Homo sapiens (Human))
Vanderbilt University Medical Center
Curated by ChEMBL
LigandPNGBDBM50395495(CHEMBL2164050)
Affinity DataEC50:  990nM. Assay description: Agonist activity at KCNQ2 expressed in CHO cells incubated for 3 mins by automated patch clamp assay
In DepthDetails ArticlePubMed