BDBM50395779 CHEMBL2164856
SMILES O=C(Nc1nnc(s1)-c1ccncc1)[C@H](Cc1ccccc1)NCc1cscn1
InChI Key InChIKey=GBRGXFKSEDHMJX-KRWDZBQOSA-N
Data  1 EC50
  Tab Delimited (TSV)   2D SDfile   Computed 3D by Vconf -m prep SDfile
Find this compound or compounds like it in BindingDB:
Activity Spreadsheet -- Enzyme Inhibition Constant Data from BindingDB
Found 1 hit for monomerid = 50395779
TargetProbable G-protein coupled receptor 142(Homo sapiens (Human))
Amgen
Curated by ChEMBL
LigandPNGBDBM50395779(CHEMBL2164856)
Affinity DataEC50:  86nM. Assay description: Agonist activity at human GPR142 expressed in HEK293 cells assessed as inositol phosphate accumulation after 1 hr by scintillation counting
In DepthDetails ArticlePubMed