BDBM50395860 CHEMBL2165520
SMILES NC1Cc2cn(c3cccc(C1)c23)S(=O)(=O)c1ccccc1
InChI Key InChIKey=LMESWUCYEXZYAH-UHFFFAOYSA-N
Data  2 KI
  Tab Delimited (TSV)   2D SDfile   Computed 3D by Vconf -m prep SDfile
Find this compound or compounds like it in BindingDB:
Activity Spreadsheet -- Enzyme Inhibition Constant Data from BindingDB
Found 2 hits for monomerid = 50395860
Target5-hydroxytryptamine receptor 6(Homo sapiens (Human))
Virginia Commonwealth University
Curated by ChEMBL
LigandPNGBDBM50395860(CHEMBL2165520)
Affinity DataKi:  1.60nM. Assay description: Displacement of [3H]LSD from human 5HT6 receptor expressed in HEK293 cells
In DepthDetails ArticlePubMed
Target5-hydroxytryptamine receptor 6(Homo sapiens (Human))
Virginia Commonwealth University
Curated by ChEMBL
LigandPNGBDBM50395860(CHEMBL2165520)
Affinity DataKi:  1.60nM. Assay description: Binding affinity to human 5-HT6 receptor
In DepthDetails ArticlePubMed