BDBM50396079 CHEMBL2170755
SMILES Oc1ccc(O)c(c1)C(=O)c1nc2ccc(O)cc2s1
InChI Key InChIKey=ZFCZNYJPBZYVQJ-UHFFFAOYSA-N
Data  3 IC50
  Tab Delimited (TSV)   2D SDfile   Computed 3D by Vconf -m prep SDfile
Find this compound or compounds like it in BindingDB:
Activity Spreadsheet -- Enzyme Inhibition Constant Data from BindingDB
Found 3 hits for monomerid = 50396079
Target17-beta-hydroxysteroid dehydrogenase type 1(Homo sapiens (Human))
Saarland University
Curated by ChEMBL
LigandPNGBDBM50396079(CHEMBL2170755)
Affinity DataIC50:  78nM. Assay description: Inhibition of human placenta 17beta-HSD1 cytosolic fraction using unlabelled and [2,4,6,7-3H]estrone as substrate after 10 mins by HPLC analysis in p...
In DepthDetails ArticlePubMed
Target17-beta-hydroxysteroid dehydrogenase type 2(Homo sapiens (Human))
Saarland University
Curated by ChEMBL
LigandPNGBDBM50396079(CHEMBL2170755)
Affinity DataIC50:  1.54E+3nM. Assay description: Inhibition of human placenta 17beta-HSD2 microsomal fraction using unlabelled and [2,4,6,7-3H]estradiol as substrate after 20 mins by HPLC analysis i...
In DepthDetails ArticlePubMed
Target17-beta-hydroxysteroid dehydrogenase type 1(Homo sapiens (Human))
Saarland University
Curated by ChEMBL
LigandPNGBDBM50396079(CHEMBL2170755)
Affinity DataIC50:  365nM. Assay description: Inhibition of 17beta-HSD1 in human T47D cells using unlabelled and [2,4,6,7-3H]estrone as substrate preincubated for 30 mins prior to substrate addit...
In DepthDetails ArticlePubMed