BDBM50396138 CHEMBL2171703
SMILES Cc1nc(C(=O)Nc2cccc(CO)n2)c(Nc2cccnc2)s1
InChI Key InChIKey=RMBCFIFYALRQKK-UHFFFAOYSA-N
Data  1 KI
  Tab Delimited (TSV)   2D SDfile   Computed 3D by Vconf -m prep SDfile
Find this compound or compounds like it in BindingDB:
Activity Spreadsheet -- Enzyme Inhibition Constant Data from BindingDB
Found 1 hit for monomerid = 50396138
TargetMetabotropic glutamate receptor 5(Homo sapiens (Human))
Amgen
Curated by ChEMBL
LigandPNGBDBM50396138(CHEMBL2171703)
Affinity DataKi:  67nM. Assay description: Antagonist activity at mGlu5 receptor
In DepthDetails ArticlePubMed